View Single Post
Old 09-03-03, 08:17 PM   #1
Spaceboy
Registered User
 
Join Date: Sep 2003
Posts: 1
Default Problem compiling Nvidia Driver on Kernel 2.6 test2

I've tried installing the Nvidia driver with a patch from http://www.minion.de/nvidia.html. However when I try to install the driver I get the following error messages:

make[1]: Entering directory `/usr/src/kernel-source-2.6.0-test2'
CHK include/linux/version.h
make[2]: `arch/i386/kernel/asm-offsets.s' is up to date.
*** Warning: Overriding SUBDIRS on the command line can cause
*** inconsistencies
CC [M] /root/Nvidia2/NVIDIA-Linux-x86-1.0-4363/usr/src/nv/nv.o
/root/Nvidia2/NVIDIA-Linux-x86-1.0-4363/usr/src/nv/nv.c: In function `nv_kern_read_agpinfo':
/root/Nvidia2/NVIDIA-Linux-x86-1.0-4363/usr/src/nv/nv.c:1877: structure has no member named `pretty_name'
make[2]: *** [/root/Nvidia2/NVIDIA-Linux-x86-1.0-4363/usr/src/nv/nv.o] Error 1
make[1]: *** [/root/Nvidia2/NVIDIA-Linux-x86-1.0-4363/usr/src/nv] Error 2
make[1]: Leaving directory `/usr/src/kernel-source-2.6.0-test2'
nvidia.ko failed to build!
make: *** [module] Error 1
Spaceboy is offline   Reply With Quote