View Single Post
Old 02-19-04, 12:17 PM   #2
vitali
Registered User
 
Join Date: Feb 2004
Posts: 2
Default compiler output

Here is the exact compiler

In file included from /home/peter/download/NVIDIA-Linux-x86-1.0-5336-pkg1/usr/src/nv/nv-linux.h:51,
from /home/peter/download/NVIDIA-Linux-x86-1.0-5336-pkg1/usr/src/nv/nv.c:14:
include/linux/kernel.h:10:20: stdarg.h: No such file or directory
In filenvidia.ko failed to build!
download/NVIDIA-Linux-x86-1.0-5336-pkg1/usr/src/nv/nv-linux.h:51,
from /home/peter/download/NVIDIA-Linux-x86-1.0-5336-pkg1/usr/src/nv/nv.c:14:
include/linux/kernel.h:71: error: parse error before "va_list"
include/linux/kernel.h:71: warning: function declaration isn't a prototype
include/linux/kernel.h:74: error: parse error before "va_list"
include/linux/kernel.h:74: warning: function declaration isn't a prototype
include/linux/kernel.h:78: error: parse error before "va_list"
include/linux/kernel.h:78: warning: function declaration isn't a prototype
/home/peter/download/NVIDIA-Linux-x86-1.0-5336-pkg1/usr/src/nv/nv.c:1185: warning: initialization from incompatible pointer type
make[3]: *** [/home/peter/download/NVIDIA-Linux-x86-1.0-5336-pkg1/usr/src/nv/nv.o] Error 1
make[2]: *** [/home/peter/download/NVIDIA-Linux-x86-1.0-5336-pkg1/usr/src/nv] Error 2
make[1]: *** [module] Error 1
make: *** [install] Error 2


Anyone have a clue?


Thanks Peter
vitali is offline   Reply With Quote