View Single Post
Old 07-14-06, 06:46 AM   #13
sc3252
Registered User
 
Join Date: Feb 2004
Posts: 23
Default Re: 7600GS and SLED10?

I found this in his log.
Code:
Using: nvidia-installer ncurses user interface
-> License accepted.
-> No precompiled kernel interface was found to match your kernel; would you li
   ke the installer to attempt to download a kernel interface for your kernel f
   rom the NVIDIA ftp site (ftp://download.nvidia.com)? (Answer: Yes)
-> No matching precompiled kernel interface was found on the NVIDIA ftp site;
   this means that the installer will need to compile a kernel interface for
   your kernel.
-> Performing CC test with CC="cc".
-> Kernel source path: '/lib/modules/2.6.16.20-0.12-smp/source'
-> Kernel output path: '/lib/modules/2.6.16.20-0.12-smp/build'
-> Performing rivafb check.
-> Performing nvidiafb check.
-> Cleaning kernel module build directory.
   executing: 'cd ./usr/src/nv; make clean'...
   rm -f -f nv.o nv-vm.o os-agp.o os-interface.o os-registry.o nv.o nv-vm.o os-
   agp.o os-interface.o os-registry.o nvidia.mod.o
   rm -f -f build-in.o nv-linux.o *.d .*.{cmd,flags}
   rm -f -f nvidia.{o,ko,mod.{o,c}} nv_compiler.h *~
   rm -f -f stprof stprof.o symtab.h
   rm -f -rf .tmp_versions
-> Building kernel module:
   executing: 'cd ./usr/src/nv; make module SYSSRC=/lib/modules/2.6.16.20-0.12-
   smp/source SYSOUT=/lib/modules/2.6.16.20-0.12-smp/build'...
   
   NVIDIA: calling KBUILD...
   make CC=cc KBUILD_OUTPUT=/lib/modules/2.6.16.20-0.12-smp/build KBUILD_VERBOS
   E=1 -C /lib/modules/2.6.16.20-0.12-smp/source SUBDIRS=/tmp/selfgz593/NVIDIA-
   Linux-x86-1.0-8174-pkg1/usr/src/nv modules
   make -C /lib/modules/2.6.16.20-0.12-smp/build \
   KBUILD_SRC=/usr/src/linux-2.6.16.20-0.12 \
   KBUILD_EXTMOD="/tmp/selfgz593/NVIDIA-Linux-x86-1.0-8174-pkg1/usr/src/nv" -f 
   /usr/src/linux-2.6.16.20-0.12/Makefile modules
   rm -rf /tmp/selfgz593/NVIDIA-Linux-x86-1.0-8174-pkg1/usr/src/nv/.tmp_version
   s
   mkdir -p /tmp/selfgz593/NVIDIA-Linux-x86-1.0-8174-pkg1/usr/src/nv/.tmp_versi
   ons
   make -f /usr/src/linux-2.6.16.20-0.12/scripts/Makefile.build obj=/tmp/selfgz
   593/NVIDIA-Linux-x86-1.0-8174-pkg1/usr/src/nv
   echo \#define NV_COMPILER \"`cc -v 2>&1 | tail -n 1`\" > /tmp/selfgz593/NVID
   IA-Linux-x86-1.0-8174-pkg1/usr/src/nv/nv_compiler.h
     cc -Wp,-MD,/tmp/selfgz593/NVIDIA-Linux-x86-1.0-8174-pkg1/usr/src/nv/.nv.o.
   d  -nostdinc -isystem /usr/lib/gcc/i586-suse-linux/4.1.0/include -D__KERNEL_
   _ -Iinclude -Iinclude2 -I/usr/src/linux-2.6.16.20-0.12/include -include /usr
   /src/linux-2.6.16.20-0.12-obj/i386/smp/include/linux/autoconf.h  -I/tmp/self
   gz593/NVIDIA-Linux-x86-1.0-8174-pkg1/usr/src/nv  -Wall -Wundef -Wstrict-prot
   otypes -Wno-trigraphs -Werror-implicit-function-declaration -fno-strict-alia
   sing -fno-common -ffreestanding -Os -fomit-frame-pointer -pipe -msoft-float 
   -mpreferred-stack-boundary=2 -march=i586 -mtune=generic -mregparm=3 -Iinclud
   e/asm-i386/mach-generic -I/usr/src/linux-2.6.16.20-0.12/include/asm-i386/mac
   h-generic -Iinclude/asm-i386/mach-default -I/usr/src/linux-2.6.16.20-0.12/in
   clude/asm-i386/mach-default -Wdeclaration-after-statement -Wno-pointer-sign 
   -I/tmp/selfgz593/NVIDIA-Linux-x86-1.0-8174-pkg1/usr/src/nv  -Wall -Wimplicit
   -Wreturn-type -Wswitch -Wformat -Wchar-subscripts -Wparentheses -Wpointer-ar
   ith -Wno-multichar -Werror -O -fno-common -MD -Wsign-compare -Wno-cast-qual 
   -Wno-error -D_LOOSE_KERNEL_NAMES -D__KERNEL__ -DMODULE -DNTRM -DNVRM -DDYNAM
   IC_SLI -DNV_MAJOR_VERSION=1 -DNV_MINOR_VERSION=0 -DNV_PATCHLEV
   EL=8174 -UDEBUG -U_DEBUG -DNDEBUG -DNV_MULTIPLE_BRIDGE_AGPGART_PRESENT -DNV_
   CHANGE_PAGE_ATTR_PRESENT -DMODULE -D"KBUILD_STR(s)=#s" -D"KBUILD_BASENAME=KB
   UILD_STR(nv)"  -D"KBUILD_MODNAME=KBUILD_STR(nvidia)" -c -o /tmp/selfgz593/NV
   IDIA-Linux-x86-1.0-8174-pkg1/usr/src/nv/.tmp_nv.o /tmp/selfgz593/NVIDIA-Linu
   x-x86-1.0-8174-pkg1/usr/src/nv/nv.c
   In file included from /usr/src/linux-2.6.16.20-0.12/include/linux/list.h:7,
                    from /usr/src/linux-2.6.16.20-0.12/include/linux/wait.h:23,
                    from include2/asm/semaphore.h:41,
                    from /usr/src/linux-2.6.16.20-0.12/include/linux/sched.h:20
   ,
                    from /usr/src/linux-2.6.16.20-0.12/include/linux/module.h:1
   0,
                    from /tmp/selfgz593/NVIDIA-Linux-x86-1.0-8174-pkg1/usr/src/
   nv/nv-linux.h:47,
                    from /tmp/selfgz593/NVIDIA-Linux-x86-1.0-8174-pkg1/usr/src/
   nv/nv.c:14:
   /usr/src/linux-2.6.16.20-0.12/include/linux/prefetch.h: In function ‘prefe
   tch_range’:
   /usr/src/linux-2.6.16.20-0.12/include/linux/prefetch.h:62: warning: pointer 
   of type ‘void *’ used in arithmetic
   In file included from /usr/src/linux-2.6.16.20-0.12/include/linux/dmapool.h:
   14,
                    from /usr/src/linux-2.6.16.20-0.12/include/linux/pci.h:558,
                    from /tmp/selfgz593/NVIDIA-Linux-x86-1.0-8174-pkg1/usr/src/
   nv/nv-linux.h:71,
                    from /tmp/selfgz593/NVIDIA-Linux-x86-1.0-8174-pkg1/usr/src/
   nv/nv.c:14:
   include2/asm/io.h: In function ‘check_signature’:
   include2/asm/io.h:258: warning: wrong type argument to increment
   In file included from /tmp/selfgz593/NVIDIA-Linux-x86-1.0-8174-pkg1/usr/src/
   nv/nv.c:14:
   /tmp/selfgz593/NVIDIA-Linux-x86-1.0-8174-pkg1/usr/src/nv/nv-linux.h:677:2: w
   arning: #warning "conftest.sh failed, assuming remap_page_range(4)!"
   /tmp/selfgz593/NVIDIA-Linux-x86-1.0-8174-pkg1/usr/src/nv/nv.c: At top level:
   /tmp/selfgz593/NVIDIA-Linux-x86-1.0-8174-pkg1/usr/src/nv/nv.c:296: warning: 
   initialization from incompatible pointer type
   /tmp/selfgz593/NVIDIA-Linux-x86-1.0-8174-pkg1/usr/src/nv/nv.c: In function 
   nvos_get_agp_device_by_class’:
   /tmp/selfgz593/NVIDIA-Linux-x86-1.0-8174-pkg1/usr/src/nv/nv.c:502: error: im
   plicit declaration of function ‘pci_find_class’
   /tmp/selfgz593/NVIDIA-Linux-x86-1.0-8174-pkg1/usr/src/nv/nv.c:502: warning: 
   assignment makes pointer from integer without a cast
   /tmp/selfgz593/NVIDIA-Linux-x86-1.0-8174-pkg1/usr/src/nv/nv.c:516: warning: 
   assignment makes pointer from integer without a cast
   /tmp/selfgz593/NVIDIA-Linux-x86-1.0-8174-pkg1/usr/src/nv/nv.c: In function 
   nvidia_init_module’:
   /tmp/selfgz593/NVIDIA-Linux-x86-1.0-8174-pkg1/usr/src/nv/nv.c:1305: error: i
   mplicit declaration of function ‘pm_register’
   /tmp/selfgz593/NVIDIA-Linux-x86-1.0-8174-pkg1/usr/src/nv/nv.c:1305: warning:
   assignment makes pointer from integer without a cast
   /tmp/selfgz593/NVIDIA-Linux-x86-1.0-8174-pkg1/usr/src/nv/nv.c:1423: error: i
   mplicit declaration of function ‘pm_unregister’
   /tmp/selfgz593/NVIDIA-Linux-x86-1.0-8174-pkg1/usr/src/nv/nv.c: In function 
   nv_kern_mmap’:
   /tmp/selfgz593/NVIDIA-Linux-x86-1.0-8174-pkg1/usr/src/nv/nv.c:1979: error: i
   mplicit declaration of function ‘remap_page_range’
   /tmp/selfgz593/NVIDIA-Linux-x86-1.0-8174-pkg1/usr/src/nv/nv.c: In function 
   nvos_count_devices’:
   /tmp/selfgz593/NVIDIA-Linux-x86-1.0-8174-pkg1/usr/src/nv/nv.c:3641: warning:
   assignment makes pointer from integer without a cast
   /tmp/selfgz593/NVIDIA-Linux-x86-1.0-8174-pkg1/usr/src/nv/nv.c:3647: warning:
   assignment makes pointer from integer without a cast
   make[4]: *** [/tmp/selfgz593/NVIDIA-Linux-x86-1.0-8174-pkg1/usr/src/nv/nv.o]
   Error 1
   make[3]: *** [_module_/tmp/selfgz593/NVIDIA-Linux-x86-1.0-8174-pkg1/usr/src/
   nv] Error 2
   make[2]: *** [modules] Error 2
   NVIDIA: left KBUILD.
   nvidia.ko failed to build!
   make[1]: *** [mdl] Error 1
   make: *** [module] Error 2
-> Error.
ERROR: Unable to build the NVIDIA kernel module.
ERROR: Installation has failed.  Please see the file
       '/var/log/nvidia-installer.log' for details.  You may find suggestions
       on fixing installation problems in the README available on the Linux
       driver download page at www.nvidia.com.
I bolded the bottom part, since it looks like his computer couldnt build the module, I didnt atempt to look into why, but you can clearly see there is something wrong.
sc3252 is offline   Reply With Quote