Go Back   nV News Forums > Linux Support Forums > NVIDIA Linux

Newegg Daily Deals

Reply
 
Thread Tools
Old 01-10-08, 01:36 AM   #13
flarkit
Gamer
 
Join Date: Apr 2007
Location: ZA
Posts: 7
Default Re: 8800GT 169.07 fan 100% loud SL10.2

Quote:
Originally Posted by Skrot
On my gentoo machine here it's part of the x11-proto/xextproto package. I'm not sure how that is represented in your distribution though. Hopefully this will help you find it.
Thanks, I'll check at home later for any "proto" packages in Synaptic. Are there any people using Ubuntu 7.10 with an 8800GT, who are running nvclock 0.8 Beta3?

I'd prefer not to use Envy if possible, since I'm wary of the changes these scripts make to package dependencies.

edit: FIXED!!!

I had to install the xorg-dev package in order to install nvcontrol. All is loveliness, thank you
flarkit is offline   Reply With Quote
Old 01-10-08, 11:10 AM   #14
BashfulTux
Registered User
 
Join Date: Apr 2006
Posts: 147
Default Re: 8800GT 169.07 fan 100% loud SL10.2

Quote:
Originally Posted by flarkit
Thanks for the info.

Ok, I installed the "libx11-dev" package and the make step went a little further, but still complains about missing header-files:

Code:
make -C src all
make[1]: Entering directory `/home/clement/Download/Nvidia/nvclock0.8b3a/src'
make[2]: Entering directory `/home/clement/Download/Nvidia/nvclock0.8b3a/src/backend'
gcc -O0 -INONE -I../.. -I../nvcontrol   -c -o backend.o backend.c
gcc -O0 -INONE -I../.. -I../nvcontrol   -c -o bios.o bios.c
gcc -O0 -INONE -I../.. -I../nvcontrol   -c -o config.o config.c
gcc -O0 -INONE -I../.. -I../nvcontrol   -c -o error.o error.c
gcc -O0 -INONE -I../.. -I../nvcontrol   -c -o nv30.o nv30.c
gcc -O0 -INONE -I../.. -I../nvcontrol   -c -o nv40.o nv40.c
gcc -O0 -INONE -I../.. -I../nvcontrol   -c -o nv50.o nv50.c
gcc -O0 -INONE -I../.. -I../nvcontrol   -c -o info.o info.c
gcc -O0 -INONE -I../.. -I../nvcontrol   -c -o overclock.o overclock.c
gcc -O0 -INONE -I../.. -I../nvcontrol   -c -o utils.o utils.c
gcc -O0 -INONE -I../.. -I../nvcontrol   -c -o i2c.o i2c.c
gcc -O0 -INONE -I../.. -I../nvcontrol   -c -o xf86i2c.o xf86i2c.c
gcc -O0 -INONE -I../.. -I../nvcontrol   -c -o adt7473.o adt7473.c
gcc -O0 -INONE -I../.. -I../nvcontrol   -c -o f75375.o f75375.c
gcc -O0 -INONE -I../.. -I../nvcontrol   -c -o lm99.o lm99.c
gcc -O0 -INONE -I../.. -I../nvcontrol   -c -o w83781d.o w83781d.c
gcc -O0 -INONE -I../.. -I../nvcontrol   -c -o w83l785r.o w83l785r.c
gcc -O0 -INONE -I../.. -I../nvcontrol   -c -o libc_wrapper.o libc_wrapper.c
gcc -O0 -INONE -I../.. -I../nvcontrol   -c -o back_linux.o back_linux.c
gcc -O0 -INONE -I../.. -I../nvcontrol   -c -o nvcontrol.o nvcontrol.c
ar cru libbackend.a backend.o bios.o config.o error.o nv30.o nv40.o nv50.o info.o overclock.o utils.o i2c.o xf86i2c.o adt7473.o f75375.o lm99.o w83781d.o w83l785r.o libc_wrapper.o back_linux.o nvcontrol.o
ranlib libbackend.a
make[2]: Leaving directory `/home/clement/Download/Nvidia/nvclock0.8b3a/src/backend'
make[2]: Entering directory `/home/clement/Download/Nvidia/nvclock0.8b3a/src/nvcontrol'
gcc -INONE -I../backend   -c -o libnvcontrol.o libnvcontrol.c
libnvcontrol.c:35:36: error: X11/extensions/extutil.h: No such file or directory
libnvcontrol.c:43: error: expected ‘=’, ‘,’, ‘;’, ‘asm’ or ‘__attribute__’ before ‘Hooks’
libnvcontrol.c:56: error: expected ‘=’, ‘,’, ‘;’, ‘asm’ or ‘__attribute__’ before ‘*’ token
libnvcontrol.c:57: error: expected ‘)’ before string constant
libnvcontrol.c: In function ‘NVQueryExtension’:
libnvcontrol.c:62: error: ‘XExtDisplayInfo’ undeclared (first use in this function)
libnvcontrol.c:62: error: (Each undeclared identifier is reported only once
libnvcontrol.c:62: error: for each function it appears in.)
libnvcontrol.c:62: error: ‘dpyinfo’ undeclared (first use in this function)
libnvcontrol.c:64: error: ‘NV_extinfo’ undeclared (first use in this function)
libnvcontrol.c: In function ‘NVQueryVersion’:
libnvcontrol.c:85: error: ‘XExtDisplayInfo’ undeclared (first use in this function)
libnvcontrol.c:85: error: ‘dpyinfo’ undeclared (first use in this function)
libnvcontrol.c:87: error: ‘NV_extinfo’ undeclared (first use in this function)
libnvcontrol.c: In function ‘NVGetAttribute’:
libnvcontrol.c:120: error: ‘XExtDisplayInfo’ undeclared (first use in this function)
libnvcontrol.c:120: error: ‘dpyinfo’ undeclared (first use in this function)
libnvcontrol.c:122: error: ‘NV_extinfo’ undeclared (first use in this function)
libnvcontrol.c: In function ‘NVGetStringAttribute’:
libnvcontrol.c:159: error: ‘XExtDisplayInfo’ undeclared (first use in this function)
libnvcontrol.c:159: error: ‘dpyinfo’ undeclared (first use in this function)
libnvcontrol.c:161: error: ‘NV_extinfo’ undeclared (first use in this function)
libnvcontrol.c: In function ‘NVGetValidAttributeValues’:
libnvcontrol.c:201: error: ‘XExtDisplayInfo’ undeclared (first use in this function)
libnvcontrol.c:201: error: ‘dpyinfo’ undeclared (first use in this function)
libnvcontrol.c:203: error: ‘NV_extinfo’ undeclared (first use in this function)
libnvcontrol.c: In function ‘NVSetAttribute’:
libnvcontrol.c:261: error: ‘XExtDisplayInfo’ undeclared (first use in this function)
libnvcontrol.c:261: error: ‘dpyinfo’ undeclared (first use in this function)
libnvcontrol.c:263: error: ‘NV_extinfo’ undeclared (first use in this function)
libnvcontrol.c: In function ‘NVSelectNotify’:
libnvcontrol.c:289: error: ‘XExtDisplayInfo’ undeclared (first use in this function)
libnvcontrol.c:289: error: ‘dpyinfo’ undeclared (first use in this function)
libnvcontrol.c:291: error: ‘NV_extinfo’ undeclared (first use in this function)
libnvcontrol.c: In function ‘wire_to_event’:
libnvcontrol.c:314: error: ‘XExtDisplayInfo’ undeclared (first use in this function)
libnvcontrol.c:314: error: ‘dpyinfo’ undeclared (first use in this function)
libnvcontrol.c:318: error: ‘NV_extinfo’ undeclared (first use in this function)
make[2]: *** [libnvcontrol.o] Error 1
make[2]: Leaving directory `/home/clement/Download/Nvidia/nvclock0.8b3a/src/nvcontrol'
make[2]: Entering directory `/home/clement/Download/Nvidia/nvclock0.8b3a/src/gtk'
make[2]: Nothing to be done for `all'.
make[2]: Leaving directory `/home/clement/Download/Nvidia/nvclock0.8b3a/src/gtk'
make[2]: Entering directory `/home/clement/Download/Nvidia/nvclock0.8b3a/src/qt'
make[2]: Nothing to be done for `all'.
make[2]: Leaving directory `/home/clement/Download/Nvidia/nvclock0.8b3a/src/qt'
make[1]: *** No rule to make target `nvcontrol/libnvcontrol.a', needed by `nvclock'.  Stop.
make[1]: Leaving directory `/home/clement/Download/Nvidia/nvclock0.8b3a/src'
make: *** [all] Error 2
Any idea in which package are the extensions found? Sorry, I'm running Ubuntu 7.10!
If you ever need to find something like this again there is a program called apt-file which can search for which package has the needed file in it, you would need to apt-file update as root then you can apt-file search file/missing.h which if using Debian gives this result.

Code:
>$ apt-file search X11/extensions/extutil.h
x11proto-xext-dev: usr/include/X11/extensions/extutil.h
x11proto-xext-dev: usr/include/X11/extensions/extutil.h
BashfulTux is offline   Reply With Quote
Reply


Thread Tools

Posting Rules
You may not post new threads
You may not post replies
You may not post attachments
You may not edit your posts

BB code is On
Smilies are On
[IMG] code is On
HTML code is Off
Forum Jump


All times are GMT -5. The time now is 06:34 AM.


Powered by vBulletin® Version 3.7.1
Copyright ©2000 - 2014, Jelsoft Enterprises Ltd.
Copyright 1998 - 2014, nV News.