Go Back   nV News Forums > Linux Support Forums > NVIDIA Linux

Newegg Daily Deals

Thread Tools
Old 11-26-09, 06:16 AM   #1
Registered User
Join Date: Mar 2009
Posts: 6
Default Error building 185.18...

I was trying to build 185.18 and am getting an error that maybe someone could help me solve?

In file included from include/linux/compat.h:14,
from /usr/src/linux-headers-2.6.31-15-generic/arch/x86/incl
from /tmp/selfgz15340/NVIDIA-Linux-x86_64-185.18.14-pkg2/us
from /tmp/selfgz15340/NVIDIA-Linux-x86_64-185.18.14-pkg2/us
/usr/src/linux-headers-2.6.31-15-generic/arch/x86/include/asm/compat.h: In f
unction ‚compat_alloc_user_space‚:
warning: pointer of type ‚void *‚ used in arithmetic
/tmp/selfgz15340/NVIDIA-Linux-x86_64-185.18.14-pkg2/usr/src/nv/os-agp.c: In
function ‚KernLoadAGPPages‚:
error: ‚agp_memory‚ has no member named ‚memory‚
make[3]: *** [/tmp/selfgz15340/NVIDIA-Linux-x86_64-185.18.14-pkg2/usr/src/nv
/os-agp.o] Error 1
make[2]: *** [_module_/tmp/selfgz15340/NVIDIA-Linux-x86_64-185.18.14-pkg2/us
r/src/nv] Error 2
nvidia.ko failed to build!
make[1]: *** [module] Error 1
make: *** [module] Error 2
-> Error.
ERROR: Unable to build the NVIDIA kernel module.
vbtalent is offline   Reply With Quote

Thread Tools

Posting Rules
You may not post new threads
You may not post replies
You may not post attachments
You may not edit your posts

BB code is On
Smilies are On
[IMG] code is On
HTML code is Off
Forum Jump

All times are GMT -5. The time now is 10:28 AM.

Powered by vBulletin® Version 3.7.1
Copyright ©2000 - 2015, Jelsoft Enterprises Ltd.
Copyright ©1998 - 2014, nV News.